TestCoreP.txt

pospelov, 13 Jun 2016 21:08

Download (10.3 KB)

 
1
[==========] Running 116620 tests from 1 test case.
2
[----------] Global test environment set-up.
3
[ RUN      ] 116620 tests from FFSymmetryTests/FFSymmetryTest
4
/Users/pospelov/development/BornAgain/BornAgain/Tests/UnitTests/Core/P/FormFactorSymmetryTest.h:29: Failure
5
The difference between real(f0) and real(f1) is 2.546407529280259e-11, which exceeds eps*avge, where
6
real(f0) evaluates to 6.4221833682396312,
7
real(f1) evaluates to 6.4221833682650953, and
8
eps*avge evaluates to 1.9266550104757979e-11.
9
[  FAILED  ] FFSymmetryTests/FFSymmetryTest.Tetrahedron/2596, where GetParam() = (((0,0),(1,0),(0,0)), ((1,0),(0,0),(0,0)), 0.01, (0.9,0)) (1 ms)
10
/Users/pospelov/development/BornAgain/BornAgain/Tests/UnitTests/Core/P/FormFactorSymmetryTest.h:29: Failure
11
The difference between real(f0) and real(f1) is 2.2548185540927079e-11, which exceeds eps*avge, where
12
real(f0) evaluates to 6.4221833682279943,
13
real(f1) evaluates to 6.4221833682505425, and
14
eps*avge evaluates to 1.9266550104717806e-11.
15
[  FAILED  ] FFSymmetryTests/FFSymmetryTest.Tetrahedron/2930, where GetParam() = (((0,0),(1,0),(0,0)), ((0,0),(1,0),(0,0)), 0.01, (-0,-1e-05)) (0 ms)
16
/Users/pospelov/development/BornAgain/BornAgain/Tests/UnitTests/Core/P/FormFactorSymmetryTest.h:29: Failure
17
The difference between real(f0) and real(f1) is 1.9620749469595467e-11, which exceeds eps*avge, where
18
real(f0) evaluates to 6.4224299373990688,
19
real(f1) evaluates to 6.4224299374186895, and
20
eps*avge evaluates to 1.9267293892692415e-11.
21
[  FAILED  ] FFSymmetryTests/FFSymmetryTest.Tetrahedron/3956, where GetParam() = (((0,0),(1,0),(0,0)), ((1,0),(0,0),(1,0)), 0.01, (0.9,0)) (1 ms)
22
/Users/pospelov/development/BornAgain/BornAgain/Tests/UnitTests/Core/P/FormFactorSymmetryTest.h:29: Failure
23
The difference between real(f0) and real(f1) is 2.2544632827248279e-11, which exceeds eps*avge, where
24
real(f0) evaluates to 6.4224490395551737,
25
real(f1) evaluates to 6.4224490395777183, and
26
eps*avge evaluates to 1.9267351514817611e-11.
27
[  FAILED  ] FFSymmetryTests/FFSymmetryTest.Tetrahedron/3958, where GetParam() = (((0,0),(1,0),(0,0)), ((1,0),(0,0),(1,0)), 0.01, (0.999,0)) (0 ms)
28
/Users/pospelov/development/BornAgain/BornAgain/Tests/UnitTests/Core/P/FormFactorSymmetryTest.h:29: Failure
29
The difference between real(f0) and real(f1) is 1.9620749469595467e-11, which exceeds eps*avge, where
30
real(f0) evaluates to 6.4224299373990688,
31
real(f1) evaluates to 6.4224299374186895, and
32
eps*avge evaluates to 1.9267293892692415e-11.
33
[  FAILED  ] FFSymmetryTests/FFSymmetryTest.Tetrahedron/4296, where GetParam() = (((0,0),(1,0),(0,0)), ((1,0),(0,0),(1,0)), 0.01, (0.9,0)) (1 ms)
34
/Users/pospelov/development/BornAgain/BornAgain/Tests/UnitTests/Core/P/FormFactorSymmetryTest.h:29: Failure
35
The difference between real(f0) and real(f1) is 2.2544632827248279e-11, which exceeds eps*avge, where
36
real(f0) evaluates to 6.4224490395551737,
37
real(f1) evaluates to 6.4224490395777183, and
38
eps*avge evaluates to 1.9267351514817611e-11.
39
[  FAILED  ] FFSymmetryTests/FFSymmetryTest.Tetrahedron/4298, where GetParam() = (((0,0),(1,0),(0,0)), ((1,0),(0,0),(1,0)), 0.01, (0.999,0)) (0 ms)
40
/Users/pospelov/development/BornAgain/BornAgain/Tests/UnitTests/Core/P/FormFactorSymmetryTest.h:29: Failure
41
The difference between real(f0) and real(f1) is 1.9656276606383472e-11, which exceeds eps*avge, where
42
real(f0) evaluates to 6.4227338840774504,
43
real(f1) evaluates to 6.4227338840577941, and
44
eps*avge evaluates to 1.9268210758831902e-11.
45
[  FAILED  ] FFSymmetryTests/FFSymmetryTest.Tetrahedron/7016, where GetParam() = (((0,0),(0,0),(1,0)), ((1,0),(1,0),(1,0)), 0.01, (0.9,0)) (0 ms)
46
/Users/pospelov/development/BornAgain/BornAgain/Tests/UnitTests/Core/P/FormFactorSymmetryTest.h:29: Failure
47
The difference between real(f0) and real(f1) is 1.9850787680297799e-11, which exceeds eps*avge, where
48
real(f0) evaluates to 6.4221833682734246,
49
real(f1) evaluates to 6.4221833682535738, and
50
eps*avge evaluates to 1.9266550104791176e-11.
51
[  FAILED  ] FFSymmetryTests/FFSymmetryTest.Tetrahedron/7349, where GetParam() = (((1,0),(1,0),(0,0)), ((1,0),(0,0),(0,0)), 0.01, (1e-06,0)) (0 ms)
52
/Users/pospelov/development/BornAgain/BornAgain/Tests/UnitTests/Core/P/FormFactorSymmetryTest.h:29: Failure
53
The difference between real(f0) and real(f1) is 1.957811690544986e-11, which exceeds eps*avge, where
54
real(f0) evaluates to 6.4221833682726146,
55
real(f1) evaluates to 6.4221833682530365, and
56
eps*avge evaluates to 1.926655010478852e-11.
57
[  FAILED  ] FFSymmetryTests/FFSymmetryTest.Tetrahedron/7358, where GetParam() = (((1,0),(1,0),(0,0)), ((1,0),(0,0),(0,0)), 0.01, (0.999,0)) (1 ms)
58
/Users/pospelov/development/BornAgain/BornAgain/Tests/UnitTests/Core/P/FormFactorSymmetryTest.h:29: Failure
59
The difference between real(f0) and real(f1) is 2.0078161355741031e-11, which exceeds eps*avge, where
60
real(f0) evaluates to 6.4221833682608223,
61
real(f1) evaluates to 6.4221833682407441, and
62
eps*avge evaluates to 1.9266550104753026e-11.
63
[  FAILED  ] FFSymmetryTests/FFSymmetryTest.Tetrahedron/7688, where GetParam() = (((1,0),(1,0),(0,0)), ((0,0),(1,0),(0,0)), 0.01, (-1e-07,0)) (0 ms)
64
/Users/pospelov/development/BornAgain/BornAgain/Tests/UnitTests/Core/P/FormFactorSymmetryTest.h:29: Failure
65
The difference between real(f0) and real(f1) is 2.7045032879868813e-11, which exceeds eps*avge, where
66
real(f0) evaluates to 6.4224492169641731,
67
real(f1) evaluates to 6.4224492169371281, and
68
eps*avge evaluates to 1.926735204990109e-11.
69
[  FAILED  ] FFSymmetryTests/FFSymmetryTest.Tetrahedron/14825, where GetParam() = (((1,0),(1,0),(1,0)), ((0,0),(1,0),(0,0)), 0.01, (1e-10,0)) (0 ms)
70
/Users/pospelov/development/BornAgain/BornAgain/Tests/UnitTests/Core/P/FormFactorSymmetryTest.h:29: Failure
71
The difference between real(f0) and real(f1) is 3.5431213518677396e-11, which exceeds eps*avge, where
72
real(f0) evaluates to 6.4227148980902786,
73
real(f1) evaluates to 6.4227148980548474, and
74
eps*avge evaluates to 1.9268153486882375e-11.
75
[  FAILED  ] FFSymmetryTests/FFSymmetryTest.Tetrahedron/15178, where GetParam() = (((1,0),(1,0),(1,0)), ((0,0),(0,0),(1,0)), 0.01, (0.999,0)) (1 ms)
76
/Users/pospelov/development/BornAgain/BornAgain/Tests/UnitTests/Core/P/FormFactorSymmetryTest.h:29: Failure
77
The difference between real(f0) and real(f1) is 2.1235457836610294e-11, which exceeds eps*avge, where
78
real(f0) evaluates to 6.422449216956351,
79
real(f1) evaluates to 6.4224492169351155, and
80
eps*avge evaluates to 1.9267352049886337e-11.
81
[  FAILED  ] FFSymmetryTests/FFSymmetryTest.Tetrahedron/15505, where GetParam() = (((1,0),(1,0),(1,0)), ((1,0),(1,0),(0,0)), 0.01, (1e-10,0)) (0 ms)
82
/Users/pospelov/development/BornAgain/BornAgain/Tests/UnitTests/Core/P/FormFactorSymmetryTest.h:29: Failure
83
The difference between real(f0) and real(f1) is 2.2544632827248279e-11, which exceeds eps*avge, where
84
real(f0) evaluates to 6.4224490395551737,
85
real(f1) evaluates to 6.4224490395777183, and
86
eps*avge evaluates to 1.9267351514817611e-11.
87
[  FAILED  ] FFSymmetryTests/FFSymmetryTest.Tetrahedron/15852, where GetParam() = (((1,0),(1,0),(1,0)), ((1,0),(0,0),(1,0)), 0.01, (-0.001,0)) (0 ms)
88
/Users/pospelov/development/BornAgain/BornAgain/Tests/UnitTests/Core/P/FormFactorSymmetryTest.h:29: Failure
89
The difference between real(f0) and real(f1) is 2.2544632827248279e-11, which exceeds eps*avge, where
90
real(f0) evaluates to 6.4224490395551737,
91
real(f1) evaluates to 6.4224490395777183, and
92
eps*avge evaluates to 1.9267351514817611e-11.
93
[  FAILED  ] FFSymmetryTests/FFSymmetryTest.Tetrahedron/16192, where GetParam() = (((1,0),(1,0),(1,0)), ((1,0),(0,0),(1,0)), 0.01, (-0.001,0)) (0 ms)
94
/Users/pospelov/development/BornAgain/BornAgain/Tests/UnitTests/Core/P/FormFactorSymmetryTest.h:29: Failure
95
The difference between real(f0) and real(f1) is 1.9334756018452026e-11, which exceeds eps*avge, where
96
real(f0) evaluates to 6.4224487828552776,
97
real(f1) evaluates to 6.4224487828359429, and
98
eps*avge evaluates to 1.9267350747368192e-11.
99
[  FAILED  ] FFSymmetryTests/FFSymmetryTest.Tetrahedron/16531, where GetParam() = (((1,0),(1,0),(1,0)), ((1,0),(1,0),(1,0)), 0.01, (0,0.0001)) (0 ms)
100
[     DONE ] 116620 tests from FFSymmetryTests/FFSymmetryTest (12214 ms total)
101
[----------] Global test environment tear-down
102
[==========] 116620 tests from 1 test case ran. (12218 ms total)
103
[  PASSED  ] 116604 tests.
104
[  FAILED  ] 16 tests, listed below:
105
[  FAILED  ] FFSymmetryTests/FFSymmetryTest.Tetrahedron/2596, where GetParam() = (((0,0),(1,0),(0,0)), ((1,0),(0,0),(0,0)), 0.01, (0.9,0))
106
[  FAILED  ] FFSymmetryTests/FFSymmetryTest.Tetrahedron/2930, where GetParam() = (((0,0),(1,0),(0,0)), ((0,0),(1,0),(0,0)), 0.01, (-0,-1e-05))
107
[  FAILED  ] FFSymmetryTests/FFSymmetryTest.Tetrahedron/3956, where GetParam() = (((0,0),(1,0),(0,0)), ((1,0),(0,0),(1,0)), 0.01, (0.9,0))
108
[  FAILED  ] FFSymmetryTests/FFSymmetryTest.Tetrahedron/3958, where GetParam() = (((0,0),(1,0),(0,0)), ((1,0),(0,0),(1,0)), 0.01, (0.999,0))
109
[  FAILED  ] FFSymmetryTests/FFSymmetryTest.Tetrahedron/4296, where GetParam() = (((0,0),(1,0),(0,0)), ((1,0),(0,0),(1,0)), 0.01, (0.9,0))
110
[  FAILED  ] FFSymmetryTests/FFSymmetryTest.Tetrahedron/4298, where GetParam() = (((0,0),(1,0),(0,0)), ((1,0),(0,0),(1,0)), 0.01, (0.999,0))
111
[  FAILED  ] FFSymmetryTests/FFSymmetryTest.Tetrahedron/7016, where GetParam() = (((0,0),(0,0),(1,0)), ((1,0),(1,0),(1,0)), 0.01, (0.9,0))
112
[  FAILED  ] FFSymmetryTests/FFSymmetryTest.Tetrahedron/7349, where GetParam() = (((1,0),(1,0),(0,0)), ((1,0),(0,0),(0,0)), 0.01, (1e-06,0))
113
[  FAILED  ] FFSymmetryTests/FFSymmetryTest.Tetrahedron/7358, where GetParam() = (((1,0),(1,0),(0,0)), ((1,0),(0,0),(0,0)), 0.01, (0.999,0))
114
[  FAILED  ] FFSymmetryTests/FFSymmetryTest.Tetrahedron/7688, where GetParam() = (((1,0),(1,0),(0,0)), ((0,0),(1,0),(0,0)), 0.01, (-1e-07,0))
115
[  FAILED  ] FFSymmetryTests/FFSymmetryTest.Tetrahedron/14825, where GetParam() = (((1,0),(1,0),(1,0)), ((0,0),(1,0),(0,0)), 0.01, (1e-10,0))
116
[  FAILED  ] FFSymmetryTests/FFSymmetryTest.Tetrahedron/15178, where GetParam() = (((1,0),(1,0),(1,0)), ((0,0),(0,0),(1,0)), 0.01, (0.999,0))
117
[  FAILED  ] FFSymmetryTests/FFSymmetryTest.Tetrahedron/15505, where GetParam() = (((1,0),(1,0),(1,0)), ((1,0),(1,0),(0,0)), 0.01, (1e-10,0))
118
[  FAILED  ] FFSymmetryTests/FFSymmetryTest.Tetrahedron/15852, where GetParam() = (((1,0),(1,0),(1,0)), ((1,0),(0,0),(1,0)), 0.01, (-0.001,0))
119
[  FAILED  ] FFSymmetryTests/FFSymmetryTest.Tetrahedron/16192, where GetParam() = (((1,0),(1,0),(1,0)), ((1,0),(0,0),(1,0)), 0.01, (-0.001,0))
120
[  FAILED  ] FFSymmetryTests/FFSymmetryTest.Tetrahedron/16531, where GetParam() = (((1,0),(1,0),(1,0)), ((1,0),(1,0),(1,0)), 0.01, (0,0.0001))
121

    
122
16 FAILED TESTS