Bug #1377

Updated by wuttke over 4 years ago

branch 'develop', commit 8776b10866f of 17mar 16h54:
<pre>


$ make
[ 0%] Building CXX object ThirdParty/gtest/gtest-1.7.0/CMakeFiles/gtest.dir/src/gtest-all.cc.o
cc1plus: fatal error: WinDllMacros.h: No such file or directory
compilation terminated.
ThirdParty/gtest/gtest-1.7.0/CMakeFiles/gtest.dir/build.make:62: recipe for target 'ThirdParty/gtest/gtest-1.7.0/CMakeFiles/gtest.dir/src/gtest-all.cc.o' failed
make[2]: *** [ThirdParty/gtest/gtest-1.7.0/CMakeFiles/gtest.dir/src/gtest-all.cc.o] Error 1
CMakeFiles/Makefile2:126: recipe for target 'ThirdParty/gtest/gtest-1.7.0/CMakeFiles/gtest.dir/all' failed
make[1]: *** [ThirdParty/gtest/gtest-1.7.0/CMakeFiles/gtest.dir/all] Error 2
Makefile:149: recipe for target 'all' failed
make: *** [all] Error 2
</pre>

Back